RDF description of
primary topic: acidité du sol

acidité du sol
type: Concept
subject: Pedology @en
subject: Pédologie
definition: Caractère acide d'un horizon ou d'un sol. (Source : INRA)
in scheme: PLP
note: L'acidité est essentiellement due à la présence d'ions H+ et Al3+. D'autres ions comme Mn2+ et Fe2+ sont également susceptibles de fournir des protons. L'acidité des horizons pédologiques joue un grand rôle vis-à-vis des plantes (spontanées ou cultivées) par le biais de la disponibilité des éléments nutritifs et de la toxicité éventuelle de métaux majeurs (aluminium) ou traces. En toute rigueur, la mesure de pH faite couramment au laboratoire porte sur un échantillon de terre fine préalablement séché, mis en suspension dans l'eau ou dans des solutions de KCl ou CaCl2, dans des conditions standard (un certain rapport solide/réactif) : il s'agit donc en réalité de l'acidité d'un échantillon de sol et non de l'acidité du sol. (Source : INRA)
preferred label: soil acidity @en
related: http://opendata.inrae.fr/PLP/702
related: http://opendata.inrae.fr/PLP/9
top concept of: PLP