RDF description of
primary topic: vertique

vertique
type: Concept
subject: Pedology @en
subject: Pédologie
definition: Qualifie un horizon argileux, situé en surface ou en profondeur, présentant des caractères vertiques (slickensides, structures sphénoïdes, autofoisonnement s'il est en surface) dus à des alternances de gonflements et de retraits et à l'abondance des minéraux argileux de type smectites. (Source : INRA)
in scheme: PLP
preferred label: vertic @en
related: http://opendata.inrae.fr/PLP/924
related: http://opendata.inrae.fr/PLP/1001
related: http://opendata.inrae.fr/PLP/862
related: http://opendata.inrae.fr/PLP/863
top concept of: PLP