vides
type: Concept
subject: Pedology @en
subject: Pédologie
definition: Ensemble des lacunes existant dans un horizon, quelles que soient leurs dimensions, leurs formes et leur origine. (Source : INRA)
in scheme: PLP
note: Les vides tirent leur origine soit de l'activité biologique (au sens large), soit de phénomènes physiques comme l'alternance d'humectations et de dessiccations, soit de phénomènes chimiques (dissolutions, altérations). On distingue trois catégories de vides en fonction de leur relation avec la structuration en agrégats : - les vides inter-agrégats : tous les espaces qui séparent les agrégats (fentes, fissures, espaces d'entassement d'agrégats non agglomérés) ; - les vides intra-agrégats : discernables à l'oil nu ou à la loupe, ils sont relativement permanents et non impliqués par la description de la structure. Par leur caractère régulièrement répété et leurs petites dimensions, ils font partie du fond matriciel. Ce sont des vides d'entassement de particules ou de micro-agrégats agglomérés, des cavités et canalicules divers dont les trous laissés par les radicelles ; - les vides trans-agrégats : en général assez gros (> 2 mm), ils sont organisés de façon relativement indépendante des agrégats élémentaires. Ce sont les chenaux et terriers d'animaux, les trous des plus grosses racines, les fentes de retrait, etc. (Source : INRA)
preferred label: voids @en
related: http://opendata.inrae.fr/PLP/738
related: http://opendata.inrae.fr/PLP/907
related: http://opendata.inrae.fr/PLP/384
top concept of: PLP

RDF description of
primary topic: vides