xérocalcicole
type: Concept
subject: Pedology @en
subject: Ecology @en
subject: Pédologie
subject: Écologie
definition: Qualifie une espèce végétale ou un groupement d'espèces que l'on trouve exclusivement ou préférentiellement sur des sols à pédoclimat sec et dans lesquels le calcium est abondant. (Source : INRA)
in scheme: PLP
preferred label: xerocalcicolous @en
top concept of: PLP

RDF description of
primary topic: xérocalcicole