RDF description of
primary topic: soil crusting

soil crusting
type: Concept
subject: Pedology
subject: Agronomie @fr
subject: Pédologie @fr
subject: Agronomy
alternative label: soil sealing
alternative label: soil capping
definition: Destruction des agrégats à la surface de certains sols sous l'impact des gouttes de pluie (ou de certains dispositifs d'irrigation), conduisant à la formation d'une mince croûte (0,5 à 5 mm) à structure litée, plus ou moins continue. (Source : INRA) @fr
in scheme: PLP
note: Cette croûte de battance fait obstacle à l'infiltration de l'eau dans le sol. Il en résulte la formation de flaques d'eau et, souvent, du ruissellement, stade initial de l'érosion. (Source : INRA) @fr
preferred label: battance @fr
related: http://opendata.inrae.fr/PLP/822
top concept of: PLP