RDF description of
primary topic: zonalité

zonalité
type: Concept
subject: Pedology @en
subject: Pédologie
definition: Théorie ancienne de la pédologie selon laquelle les différents types de pédogenèse s'organisent à l'échelle planétaire en grandes zones, définies principalement par leur climat et leur végétation. (Source : INRA)
in scheme: PLP
note: En conséquence, on distinguait : - des sols zonaux, relativement indépendants de leur matériau parental, mais dépendant étroitement du climat et de la végétation ; - des sols azonaux, sols peu évolués dont les caractères sont très proches de ceux de leur roche-mère (sols encore très jeunes ou dont l'évolution est très ralentie par différents facteurs) ; - et des sols intrazonaux, pour lesquels le principal facteur de pédogenèse est une caractéristique locale (matériau parental, excès d'eau, halomorphie, etc.), indépendamment de la zone climatique où ils se situent. Cette théorie donne trop d'importance aux grandes zones climatiques et ne prend pas assez en compte le rôle des particularités stationnelles (propriétés des matériaux parentaux, conditions hydrologiques locales, relief, mésoclimat) et des changements de végétation induits par l'homme. (Source : INRA)
preferred label: soil zonation @en
related: http://opendata.inrae.fr/PLP/95
top concept of: PLP