zone de fluctuation du niveau de la nappe
type: Concept
subject: Hydrologie
subject: Hydrology @en
alternative label: zone de battement de nappe
definition: Couches du sol et/ou des roches sous-jacentes dans lesquelles s'opèrent les fluctuations du niveau de la surface libre d'une nappe, au cours du temps. (Source : INRA)
in scheme: PLP
preferred label: zone of watertable fluctuation @en
related: http://opendata.inrae.fr/PLP/639
top concept of: PLP

RDF description of
primary topic: zone de fluctuation du niveau de la nappe