ferrallitisols
type: Concept
subject: Pedology @en
subject: Pédologie
definition: Sols des climats tropicaux humides, très anciens et très épais, caractérisés par l'altération très poussée des minéraux, y compris du quartz ; l'élimination de la majeure partie des cations alcalins et alcalino-terreux ; la forte teneur en sesquioxydes de fer assez souvent accompagnés de sesquioxydes d'aluminium ; la présence presque exclusive de la kaolinite comme minéral argileux (Référentiel Pédologique 2007). (Source : INRA)
in scheme: PLP
related: http://opendata.inrae.fr/PLP/877
top concept of: PLP

RDF description of
primary topic: ferrallitisols