RDF description of
primary topic: sensitive to crusting

sensitive to crusting
type: Concept
subject: Pedology
subject: Agronomie @fr
subject: Pédologie @fr
subject: Agronomy
alternative label: sensitive to capping
alternative label: sensitive to sealing
definition: Qualifie un sol cultivé dont l'horizon de surface présente des propriétés favorables au développement du phénomène de battance en saison pluvieuse. (Source : INRA) @fr
in scheme: PLP
note: Un tel horizon est caractérisé par une faible teneur en argile et en matières organiques et une grande abondance des limons. (Source : INRA) @fr
preferred label: battant @fr
related: http://opendata.inrae.fr/PLP/901
top concept of: PLP