bauxitisation
type: Concept
definition: Mécanisme d'altération de divers tecto- et phyllosilicates, conduisant à la formation de gibbsite, par lixiviation progressive des cations alcalins et alcalinoterreux et de toute la silice. (Source : INRA)
in scheme: PLP
preferred label: bauxitization @en
related: http://opendata.inrae.fr/PLP/409
related: http://opendata.inrae.fr/PLP/35
top concept of: PLP

RDF description of
primary topic: bauxitisation