RDF description of
primary topic: beidellites

beidellites
type: Concept
subject: Mineralogy @en
subject: Pedology @en
subject: Minéralogie
subject: Pédologie
definition: Minéraux phylliteux 2/1 dioctaédriques avec substitution en couche tétraédrique et équidistance des feuillets variable. (Source : INRA)
in scheme: PLP
note: Deux variétés sont connues, la beidellite ferrifère ou nontronite où Fe3+ remplace presque complètement Al3+ et un type chromifère où Cr3+ remplace partiellement Al3+. (Source : INRA)
related: http://opendata.inrae.fr/PLP/615
related: http://opendata.inrae.fr/PLP/626
related: http://opendata.inrae.fr/PLP/863
related: http://opendata.inrae.fr/PLP/653
top concept of: PLP