RDF description of
primary topic: besoin en chaux

besoin en chaux
type: Concept
subject: Agronomie
subject: Agronomy @en
definition: Quantité d'amendements calciques, à l'exclusion du gypse et du plâtre, nécessaire pour remonter le pH d'un sol à une valeur souhaitée. (Source : INRA)
in scheme: PLP
preferred label: lime requirement @en
related: http://opendata.inrae.fr/PLP/50
related: http://opendata.inrae.fr/PLP/49
top concept of: PLP