RDF description of
primary topic: bigénétique

bigénétique
type: Concept
subject: Pedology @en
subject: Pédologie
definition: Qualifie un solum dont la pédogenèse actuelle se superpose à une autre pédogenèse antérieure différente, laquelle explique certains caractères morphologiques ou minéralogiques (Référentiel Pédologique 2007). (Source : INRA)
in scheme: PLP
top concept of: PLP