bilan hydrique
type: Concept
subject: Pedology @en
subject: Agronomie
subject: Pédologie
subject: Agronomy @en
definition: Bilan des apports et des pertes en eau, calculé ou estimé sur une période déterminée (décade, mois, année), pour un certain volume de sol. (Source : INRA)
in scheme: PLP
note: Les différents termes du bilan hydrique sont : - les apports par les précipitations, l'irrigation, le ruissellement superficiel, les circulations hypodermiques, les remontées capillaires ; - les pertes par l'évapotranspiration, le ruissellement superficiel, les circulations hypodermiques, les eaux percolant vers la profondeur. (Source : INRA)
preferred label: water balance @en
top concept of: PLP

RDF description of
primary topic: bilan hydrique