biogène
type: Concept
subject: Pedology @en
subject: Pédologie
definition: Qualifie une modification ou un processus lié à un ou plusieurs organismes vivants (homme exclu). (Source : INRA)
in scheme: PLP
note: S'oppose à anthropogène et à géogène. (Source : INRA)
preferred label: biogenic @en
top concept of: PLP

RDF description of
primary topic: biogène