RDF description of
primary topic: biomacrostructuré

biomacrostructuré
type: Concept
subject: Pedology @en
subject: Pédologie
definition: Qualifie un horizon A montrant une structure grumeleuse ou grenue, construite par une intense activité biologique (Référentiel Pédologique). (Source : INRA)
in scheme: PLP
note: Ce type de structure résulte d'un brassage par les vers de terre de la totalité de la masse humique avec des particules minérales. (Source : INRA)
preferred label: with a biotic macrostructure @en
related: http://opendata.inrae.fr/PLP/907
related: http://opendata.inrae.fr/PLP/332
related: http://opendata.inrae.fr/PLP/997
related: http://opendata.inrae.fr/PLP/457
top concept of: PLP