RDF description of
primary topic: bore

bore
type: Concept
subject: Pedology @en
subject: Agronomie
subject: Pédologie
subject: Agronomy @en
definition: Oligoélément non métallique présent dans les sols en très faibles quantités (2 à 200 mg/kg dont moins de 5 % sous une forme assimilable). (Source : INRA)
in scheme: PLP
note: Dans certaines circonstances (stocks du sol insuffisants, conditions de pH, état hydrique) des carences peuvent survenir sur des plantes sensibles (betterave, carotte, colza, vigne, etc.). (Source : INRA)
preferred label: boron @en
top concept of: PLP