RDF description of
primary topic: acidité effective

acidité effective
type: Concept
subject: Pedology @en
subject: Pédologie
definition: Concentration de la solution du sol en H3O+. (Source : INRA)
in scheme: PLP
preferred label: effective acidity @en
top concept of: PLP