RDF description of
primary topic: boulettes fécales

boulettes fécales
type: Concept
subject: Pedology @en
subject: Pédologie
definition: Excrétions ovoïdes de la mésofaune du sol. (Source : INRA)
in scheme: PLP
note: Constituées essentiellement de matières organiques sans débris figurés visibles à l'œil nu, ces boulettes se présentent comme des amas holorganiques de formes variables (sphéroïdes, ovoïdes, etc.) de quelques dizaines de µm à 1 ou 2 mm de diamètre. Elles sont formées de matériel majoritairement végétal ou fongique, microfragmenté et aggloméré. (Source : INRA)
preferred label: faecal pellets @en
related: http://opendata.inrae.fr/PLP/472
related: http://opendata.inrae.fr/PLP/623
top concept of: PLP