RDF description of
primary topic: crushing

crushing
type: Concept
subject: Pedology
subject: Agronomie @fr
subject: Pédologie @fr
subject: Agronomy
alternative label: grinding
alternative label: milling
definition: Action de réduire en fragments plus petits par pression ou chocs. (Source : INRA) @fr
in scheme: PLP
note: Ne pas confondre le concassage des agrégats pour préparer la terre fine (crushing) et le véritable broyage de la terre fine préalable aux analyses chimiques (grinding, milling). (Source : INRA) @fr
preferred label: broyage @fr
related: http://opendata.inrae.fr/PLP/960
related: http://opendata.inrae.fr/PLP/323
related: http://opendata.inrae.fr/PLP/753
related: http://opendata.inrae.fr/PLP/711
top concept of: PLP