brunisols
type: Concept
subject: Pedology @en
subject: Pédologie
definition: Catégories de sols non calcaires caractérisés par la présence d'un horizon structural (horizon S) très bien développé et possédant une notable macro-porosité fissurale et biologique (Référentiel Pédologique). (Source : INRA)
in scheme: PLP
note: Les brunisols ne montrent pas de différenciation texturale notable. Ce sont donc des sols "brunifiés" non argilluviés (ancien groupe des "sols bruns" de la classification de la Commission de Pédologie et de Cartographie des Sols (1967). Leur pédogenèse est marquée par des altérations modérées et par une faible néogenèse d'argiles. Leur pH eau est presque toujours compris entre 5,0 et 6,5 sous forêt et, en général, il n'excède pas 7,6 sous cultures. Le taux de saturation est variable, en fonction de la roche-mère, de la végétation ou de l'histoire du site (cultures, prairies, friche, etc.). Sous forêt, en règle générale, l'épisolum humifère est un eumull ou un mésomull (plus rarement un oligomull) dont l'horizon A présente une structure construite d'origine biologique (horizon A biomacrostructuré). L'activité biologique favorise la constitution de complexes argiles-humus-fer stables. (Source : INRA)
related: http://opendata.inrae.fr/PLP/124
related: http://opendata.inrae.fr/PLP/123
top concept of: PLP

RDF description of
primary topic: brunisols