RDF description of
primary topic: calcaire (Géologie)

calcaire (Géologie)
type: Concept
subject: Geology @en
subject: Géologie
modified: 2020-08-20T09:09:52.798+02:00
definition: Roche sédimentaire contenant plus de 50 % de CaCO3. (Source : INRA)
in scheme: PLP
note: Pour désigner les divers calcaires on utilise une nomenclature pratique fondée sur différents critères : - proportion de calcite et de dolomite (calcaire magnésien ; calcaire dolomitique) ; - proportion d'argile (calcaire marneux) ; - milieu de dépôt (calcaire marin, calcaire lacustre, calcaire fluviatile, croûtes calcaires de certains sols) ; - dimensions du grain (calcaire micritique, calcaire grenu, calcaire saccharoïde) ; - structure (calcaire oolithique ; calcaire graveleux, calcaire massif) ; - importance des fossiles ou de leurs débris (calcaire lumachellique ; calcaires bioclastiques ; calcaire à entroques) ; - présence de matériel terrigène (calcaire silteux). (Source : INRA)
preferred label: limestone (Geology) @en
related: http://opendata.inrae.fr/PLP/250
related: http://opendata.inrae.fr/PLP/155
related: http://opendata.inrae.fr/PLP/359
top concept of: PLP