RDF description of
primary topic: acido-complexolyse

acido-complexolyse
type: Concept
subject: Pedology @en
subject: Pédologie
definition: Processus biochimique d'altération défini comme une attaque des minéraux primaires par des solutions contenant des composés organiques acides et complexants. (Source : INRA)
in scheme: PLP
note: Il en résulte une élimination de l'aluminium, du fer et des cations alcalins et alcalino-terreux, et la formation d'un horizon résiduel appauvri en ces éléments (horizon E). (Source : INRA)
preferred label: acido-complexolysis @en
related: http://opendata.inrae.fr/PLP/727
top concept of: PLP