calcarifuge
type: Concept
subject: Ecology @en
subject: Pedology @en
subject: Pédologie
subject: Écologie
modified: 2020-07-03T10:56:29.983+02:00
definition: Qualifie une espèce végétale ou un groupement d'espèces qui ne tolère pas la présence de calcaire, notamment le calcaire actif, dans les sols. (Source : INRA)
in scheme: PLP
preferred label: calciphobe @en
top concept of: PLP

RDF description of
primary topic: calcarifuge