RDF description of
primary topic: calcarisols

calcarisols
type: Concept
subject: Pedology @en
subject: Pédologie
definition: Catégorie de sols carbonatés caractérisés par l'existence à faible profondeur (moins de 35 cm) d'horizons d'accumulation de calcaire secondaire (Référentiel Pédologique 2007). (Source : INRA)
in scheme: PLP
related: http://opendata.inrae.fr/PLP/462
top concept of: PLP