RDF description of
primary topic: calcique

calcique
type: Concept
subject: Pedology @en
subject: Pédologie
definition: Relatif au calcium ou dont le complexe d'échange est saturé, principalement par du calcium. (Source : INRA)
in scheme: PLP
preferred label: calcium-saturated @en
related: http://opendata.inrae.fr/PLP/144
related: http://opendata.inrae.fr/PLP/449
top concept of: PLP