calcite
type: Concept
subject: Geology
subject: Pedology
subject: Géologie @fr
subject: Pédologie @fr
definition: Forme cristalline la plus courante du carbonate de calcium dans les roches et dans les sols. (Source : INRA) @fr
in scheme: PLP
related: http://opendata.inrae.fr/PLP/155
top concept of: PLP

RDF description of
primary topic: calcite