calcium
type: Concept
subject: Pedology @en
subject: Agronomie
subject: Pédologie
subject: Agronomy @en
alternative label: Ca
definition: Métal alcalino-terreux, très fréquent dans les sols, sous la forme de carbonates (sols calcaires ou dolomitiques), sous la forme de sulfate (gypse), ou bien, en plus faible abondance, comme constituant de certains silicates (feldspaths sodi-calciques) ou encore sous la forme de cations échangeables Ca2+. (Source : INRA)
in scheme: PLP
note: Ces cations sont des agents efficaces de la floculation des colloïdes et donc de la stabilité des agrégats. Outre ce rôle majeur sur la structuration des sols, ce macroélément joue aussi un rôle physiologique éminent : il favorise la nutrition minérale des plantes via la remontée du pH, stimule l'activité biologique et règle les équilibres ioniques avec Mg et Ca dans les cellules. (Source : INRA)
related: http://opendata.inrae.fr/PLP/155
related: http://opendata.inrae.fr/PLP/141
related: http://opendata.inrae.fr/PLP/130
related: http://opendata.inrae.fr/PLP/431
related: http://opendata.inrae.fr/PLP/129
related: http://opendata.inrae.fr/PLP/128
top concept of: PLP

RDF description of
primary topic: calcium