RDF description of
primary topic: calcosols

calcosols
type: Concept
subject: Pedology @en
subject: Pédologie
definition: Catégorie de sols, présentant au moins deux horizons, carbonatés sur toute leur épaisseur, avec dominance du carbonate de calcium (Référentiel Pédologique). (Source : INRA)
in scheme: PLP
related: http://opendata.inrae.fr/PLP/142
related: http://opendata.inrae.fr/PLP/284
top concept of: PLP