RDF description of
primary topic: caliche

caliche
type: Concept
subject: Pedology @en
subject: Pédologie
alternative label: caliche layer @en
definition: Croûtes calcaires ou dolomitiques se formant en surface ou à faible profondeur, sous climat aride ou semi-aride. (Source : INRA)
in scheme: PLP
note: Terme vernaculaire mexicain. (Source : INRA)
related: http://opendata.inrae.fr/PLP/232
related: http://opendata.inrae.fr/PLP/146
top concept of: PLP