RDF description of
primary topic: capacité au champ

capacité au champ
type: Concept
subject: Pedology @en
subject: Agronomie
subject: Pédologie
subject: Agronomy @en
definition: Teneur maximale d'un horizon en eau non mobilisable par la seule force de gravité. (Source : INRA)
in scheme: PLP
note: Pour déterminer cette teneur, l'horizon étudié doit préalablement connaître un excès d'eau suivi d'un ressuyage vertical avec drainage libre. Cette valeur ne peut donc être déterminée que sur le sol en place, en hiver ou au printemps. (Source : INRA)
preferred label: field capacity @en
related: http://opendata.inrae.fr/PLP/759
related: http://opendata.inrae.fr/PLP/152
related: http://opendata.inrae.fr/PLP/701
top concept of: PLP