RDF description of
primary topic: acidolyse

acidolyse
type: Concept
subject: Pedology @en
subject: Pédologie
definition: Hydrolyse des minéraux primaires par des solutions acides, sans intervention notable des matières organiques. (Source : INRA)
in scheme: PLP
preferred label: acidolysis @en
top concept of: PLP