capacité de rétention
type: Concept
subject: Pedology @en
subject: Agronomie
subject: Pédologie
subject: Agronomy @en
definition: Quantité d'eau retenue par un horizon ou un échantillon de sol à tel ou tel degré de contrainte, mesurée au laboratoire par diverses techniques. (Source : INRA)
in scheme: PLP
preferred label: water holding capacity @en
related: http://opendata.inrae.fr/PLP/759
related: http://opendata.inrae.fr/PLP/297
related: http://opendata.inrae.fr/PLP/807
related: http://opendata.inrae.fr/PLP/486
top concept of: PLP

RDF description of
primary topic: capacité de rétention