carbonate-rich
type: Concept
subject: Pedology
subject: Pédologie @fr
alternative label: carbonate-bearing
definition: Qualifie un horizon, un sol ou un matériau qui contient des carbonates (calcite ou dolomite). (Source : INRA) @fr
in scheme: PLP
preferred label: carbonaté @fr
related: http://opendata.inrae.fr/PLP/155
top concept of: PLP

RDF description of
primary topic: carbonate-rich