RDF description of
primary topic: carbonates

carbonates
type: Concept
subject: Mineralogy @en
subject: Pedology @en
subject: Minéralogie
subject: Pédologie
definition: Minéraux caractérisés par l'ion (CO3)2-. (Source : INRA)
in scheme: PLP
note: Dans les sols, existent souvent des carbonates de calcium (calcite, aragonite), parfois un carbonate double de calcium et de magnésium (dolomite). Dans le cas de pollutions d'origine industrielle, des carbonates de néoformation peuvent apparaître, par exemple de plomb (cérusite) ou de cuivre (malachite). (Source : INRA)
related: http://opendata.inrae.fr/PLP/281
related: http://opendata.inrae.fr/PLP/144
related: http://opendata.inrae.fr/PLP/143
related: http://opendata.inrae.fr/PLP/154
related: http://opendata.inrae.fr/PLP/130
related: http://opendata.inrae.fr/PLP/156
related: http://opendata.inrae.fr/PLP/129
related: http://opendata.inrae.fr/PLP/128
top concept of: PLP