RDF description of
primary topic: carbone

carbone
type: Concept
subject: Pedology @en
subject: Agronomie
subject: Pédologie
subject: Agronomy @en
definition: Élément chimique de grande importance dans les sols. (Source : INRA)
in scheme: PLP
note: Le carbone organique est impliqué dans toutes les matières organiques vivantes ou non. Le carbone minéral est intégré aux ions carbonates. (Source : INRA)
preferred label: carbon @en
related: http://opendata.inrae.fr/PLP/155
related: http://opendata.inrae.fr/PLP/594
related: http://opendata.inrae.fr/PLP/775
top concept of: PLP