cartogramme
type: Concept
subject: Géographie
subject: Geography @en
definition: Représentation sur une carte de toutes les observations, analyses ou mesures au moyen de symboles, de formes et de couleurs variées, mais ne comportant aucune limite. (Source : INRA)
in scheme: PLP
top concept of: PLP

RDF description of
primary topic: cartogramme