RDF description of
primary topic: acrotelm

acrotelm
type: Concept
subject: Pedology @en
subject: Pédologie
definition: Niveaux supérieurs des solums d'histosols (50 premiers cm environ) présentant, relativement aux parties inférieures, une conductivité hydraulique élevée, des échanges nombreux entre l'eau et l'atmosphère, des fluctuations importantes de la nappe et une forte activité des organismes aérobies. (Source : INRA)
in scheme: PLP
related: http://opendata.inrae.fr/PLP/166
top concept of: PLP