catena
type: Concept
subject: Pedology @en
subject: Pédologie
alternative label: caténa
alternative label: chaîne de sols
definition: Séquence de sols, issus d'un même matériau parental, se succédant du haut en bas d'un versant et dont les différences sont dues à la position topographique sur ce versant. (Source : INRA)
in scheme: PLP
note: Tous les sols sont donc liés pédogénétiquement, chacun d'eux ayant reçu de son voisin ou cédé à son voisin certains constituants. (Source : INRA)
related: http://opendata.inrae.fr/PLP/992
related: http://opendata.inrae.fr/PLP/973
top concept of: PLP

RDF description of
primary topic: catena