RDF description of
primary topic: cations alcalins

cations alcalins
type: Concept
subject: Pedology @en
subject: Agronomie
subject: Pédologie
subject: Agronomy @en
definition: Cations des métaux monovalents de la colonne 1A de la classification périodique des éléments. (Source : INRA)
in scheme: PLP
note: Dans les sols, les cations alcalins les plus fréquents sont le potassium (K+) et le sodium (Na+). (Source : INRA)
preferred label: alkali cations @en
top concept of: PLP