RDF description of
primary topic: vugh

vugh
type: Concept
subject: Micromorphology
subject: Pedology
subject: Pédologie @fr
subject: Micromorphologie @fr
alternative label: cavity
definition: Espace vide dans un matériau pédologique, autre que les vides d'entassement, de formes irrégulières et non connectés avec les autres vides de dimensions équivalentes. (Source : INRA) @fr
in scheme: PLP
preferred label: cavité @fr
top concept of: PLP