RDF description of
primary topic: activité biologique

activité biologique
type: Concept
subject: Pedology @en
subject: Agronomie
subject: Pédologie
subject: Agronomy @en
definition: Ensemble des actions directes et indirectes des organismes vivant dans les sols ou qui y sont enracinés (microorganismes, champignons, insectes, vers, animaux supérieurs, plantes, etc.). (Source : INRA)
in scheme: PLP
note: On peut distinguer quatre grands types d'actions : - les altérations de minéraux et les évolutions pédogénétiques ; - les apports de matières organiques fraîches, puis leurs transformations ; - l'absorption d'éléments chimiques (nutritifs, oligo-éléments, métaux potentiellement toxiques) ; - la construction d'agrégats particuliers. (Source : INRA)
preferred label: biological activity @en
related: http://opendata.inrae.fr/PLP/492
related: http://opendata.inrae.fr/PLP/916
related: http://opendata.inrae.fr/PLP/612
top concept of: PLP