charge
type: Concept
subject: Pedology @en
subject: Agronomie
subject: Pédologie
subject: Agronomy @en
alternative label: pierrosité
definition: Quantité d'éléments grossiers (graviers, cailloux et plus gros) présents dans un horizon ou un sol. (Source : INRA)
in scheme: PLP
preferred label: stoniness @en
related: http://opendata.inrae.fr/PLP/316
top concept of: PLP

RDF description of
primary topic: charge