charges critiques
type: Concept
subject: Pedology @en
subject: Pédologie
definition: Flux d'entrée de polluants atmosphériques au-delà desquels les sols sont en régime d'enrichissement progressif. (Source : INRA)
in scheme: PLP
note: Cette notion a été définie initialement pour les pluies acides et les risques liés à l'acidification des sols. Déterminer une charge critique implique non seulement de déterminer les entrées mais également les flux de sortie par la végétation (exportations) et la lixiviation vers la profondeur. (Source : INRA)
preferred label: critical loads @en
top concept of: PLP

RDF description of
primary topic: charges critiques