charges permanentes
type: Concept
subject: Pedology @en
subject: Pédologie
definition: Charges, presque toujours négatives, de certains minéraux (principalement des phyllosilicates) dues au remplacement dans le réseau cristallin de certains cations par d'autres de charge différente (substitution isomorphique). (Source : INRA)
in scheme: PLP
preferred label: permanent charges @en
top concept of: PLP

RDF description of
primary topic: charges permanentes