charges variables
type: Concept
subject: Pedology @en
subject: Pédologie
definition: Charges dues aux réactions des groupements fonctionnels superficiels des phases solides du sol (minéraux et matières organiques) avec certains ions de la solution du sol, particulièrement H+ et OH-. (Source : INRA)
in scheme: PLP
note: Ces charges dépendent donc de la composition de la solution du sol, en particulier de son pH. (Source : INRA)
preferred label: variable charges @en
top concept of: PLP

RDF description of
primary topic: charges variables