RDF description of
primary topic: chaulage

chaulage
type: Concept
subject: Pedology @en
subject: Agronomie
subject: Pédologie
subject: Agronomy @en
definition: Application de chaux ou de matières calcaires (marnes, calcaires, craie, tangue, écumes de défécation) sur une parcelle agricole comme amendement basique calcique. (Source : INRA)
in scheme: PLP
preferred label: liming @en
related: http://opendata.inrae.fr/PLP/49
top concept of: PLP