chernozems
type: Concept
subject: Pedology @en
subject: Pédologie
alternative label: tchernozems
alternative label: tchernoziums
definition: Sols caractérisés par leur couleur noire, une très fine structure, une forte activité biologique, une forte imprégnation de matières organiques très humifiées en profondeur et qui sont réputés pour leur fertilité. (Source : INRA)
in scheme: PLP
note: Très fréquents en Ukraine, en Moldavie et au sud de la Russie, ils constituent un groupe de sols de référence de la Base de référence mondiale pour les ressources en sols (WRB). Ce terme est d'origine russe. (Source : INRA)
related: http://opendata.inrae.fr/PLP/704
related: http://opendata.inrae.fr/PLP/178
top concept of: PLP

RDF description of
primary topic: chernozems