RDF description of
primary topic: chernosols

chernosols
type: Concept
subject: Pedology @en
subject: Pédologie
definition: Catégories de sols caractérisés par l'existence d'un horizon Ach (A " chernique ") d'au moins 40 cm d'épaisseur et correspondant aux chernozems (Référentiel Pédologique). (Source : INRA)
in scheme: PLP
note: Cet horizon de surface est riche en matières organiques très évoluées, dont la teneur diminue progressivement avec la profondeur (caractère " clinohumique "). En conditions de végétation permanente, la teneur en carbone est d'au moins de 3 % dans les 10 premiers centimètres pour une texture argilolimoneuse. L'horizon Ach présente à l'état humide une couleur noire, il est généralement non calcaire ; il peut l'être faiblement (moins de 5 %). En conditions de végétation permanente, sa structure est grenue, grumeleuse ou polyédrique subangulaire fine ou très fine ou à sous-structure fine (agrégats inférieurs à 2 mm). Cette structure caractéristique est due notamment à de fréquents brassages d'origine biologique. Elle peut être partiellement ou totalement dégradée en surface par la mise en cultures (horizon LAh agricompacté, à structure polyédrique grossière et tendance massive). (Source : INRA)
related: http://opendata.inrae.fr/PLP/177
top concept of: PLP