RDF description of
primary topic: chlorites

chlorites
type: Concept
subject: Mineralogy @en
subject: Pedology @en
subject: Minéralogie
subject: Pédologie
definition: Minéraux argileux ferromagnésiens à feuillets élémentaires épais de 1,4 nm, communs dans certaines roches magmatiques ou faiblement métamorphiques, où ils résultent de l'altération de silicates ferromagnésiens. (Source : INRA)
in scheme: PLP
note: Bien connues des géologues sous leurs formes macrocristallines, les chlorites sont largement représentées dans les fractions les plus fines (argiles, limons) de certains sédiments. Dans certains sols, elles résultent de néoformations liées à des types spécifiques d'altération (chlorites gonflantes ou pseudochlorites ou chlorites secondaires). (Source : INRA)
related: http://opendata.inrae.fr/PLP/626
related: http://opendata.inrae.fr/PLP/615
related: http://opendata.inrae.fr/PLP/181
top concept of: PLP